love-0.5.0 failed to compile

Questions about the LÖVE API, installing LÖVE and other support related questions go here.
Forum rules
Before you make a thread asking for help, read this.
User avatar
Robin
The Omniscient
Posts: 6506
Joined: Fri Feb 20, 2009 4:29 pm
Location: The Netherlands
Contact:

Re: love-0.5.0 failed to compile

Post by Robin » Wed Jun 03, 2009 6:26 am

bartbes wrote:(details.. details...)
You're absolutely right. What I meant was that, while the missing header caused the problem, it sounds more like "file missing" than "boost missing". "'boost' not declared", on the other hand, might be the effect, but it actually sounds like "boost missing". Anyway, as you said: details... details...
Help us help you: attach a .love.

ghost333
Prole
Posts: 2
Joined: Tue Jun 02, 2009 5:21 pm

Re: love-0.5.0 failed to compile

Post by ghost333 » Thu Jun 04, 2009 9:40 am

i installed an older version of boost and things are fine now.


tried to install on my laptop also :

Code: Select all

	mv -f $depbase.Tpo $depbase.Po
physfs/File.cpp: In member function ‘virtual bool love_physfs::File::write(const char*, int)’:
physfs/File.cpp:112: error: ‘strlen’ was not declared in this scope
make[2]: *** [physfs/File.o] Error 1
make[2]: Leaving directory `/home/markos/Desktop/love-0.5-0/src'
make[1]: *** [all-recursive] Error 1
make[1]: Leaving directory `/home/markos/Desktop/love-

Post Reply

Who is online

Users browsing this forum: Bing [Bot], Google [Bot] and 12 guests